{"text_format":"1","workbook":"xlsx","n_sheets":26,"sheets":["Unidades","Productos","ENEMT","ENEFN","FEBMT","FEBFN","MARMT","MARFN","ABRMT","ABRFN","MAYMT","MAYFN","JUNFN","JUNMT","JULMT","JULFN","AGOMT","AGOFN","SEPMT","SEPFN","OCTMT","OCTFN","NOVMT","NOVFN","DICMT","DICFN"],"not_rendered":{"charts":0,"images":0,"macros":1,"external_links":0,"defined_names":25,"comments":0,"pivot_tables":0},"unopened":[],"bounds":{"document_bytes":16777216,"sheet_cells":100000,"rows_first":2000,"rows_last":500,"rows_between":2000,"halvings":0,"cell_chars":16384,"cell_head_chars":4096},"cells_cut":0,"cells_raw":0,"read":"whole","date_system":"1900"}

{"sheet":"Unidades","index":0,"n_rows":17,"n_cols":2,"rows_kept":17,"cut":false,"hidden":false,"merged":[]}
["CODIGO","UNIDAD"]
[201,"DIRECCIÓN ADMINISTRATIVA"]
[202,"DIRECCIÓN GENERAL DE CAMINOS"]
[203,"UNIDAD EJECUTORA DE CONSERVACIÓN VIAL -COVIAL-"]
[204,"DIRECCIÓN GENERAL DE TRANSPORTES"]
[205,"DIRECCIÓN GENERAL DE AERONÁUTICA CIVIL"]
[206,"UNIDAD DE CONSTRUCCIÓN DE EDIFICIOS DEL ESTADO -UCEE-"]
[207,"DIRECCIÓN GENERAL DE RADIODIFUSIÓN Y TELEVISIÓN NACIONAL"]
[208,"UNIDAD DE CONTROL Y SUPERVISIÓN DE CABLE -UNCOSU-"]
[209,"INSTITUTO NACIONAL DE SISMOLOGÍA, VULCANOLOGÍA, METEOROLOGÍA E HIDROLOGÍA -INSIVUMEH-"]
[210,"DIRECCIÓN GENERAL DE CORREOS Y TELÉGRAFOS"]
[211,"SUPERINTENDENCIA DE TELECOMUNICACIONES -SIT-"]
[212,"FONDO PARA EL DESARROLLO DE LA TELEFONÍA -FONDETEL-"]
[214,"UNIDAD PARA EL DESARROLLO DE VIVIENDA POPULAR -UDEVIPO-"]
[216,"DIRECCIÓN GENERAL DE PROTECCIÓN Y SEGURIDAD VIAL -PROVIAL-"]
{"$rows_left_out":3}
{"sheet":"Productos","index":1,"n_rows":159,"n_cols":65,"rows_kept":159,"cut":false,"hidden":false,"merged":[[6,63,6,64],[0,2,0,42],[2,2,2,42],[6,51,6,52],[6,53,6,54],[6,55,6,56],[6,57,6,58],[6,59,6,60],[6,61,6,62],[6,10,6,13],[6,14,6,16],[5,17,5,40],[5,41,5,64],[6,41,6,42],[6,43,6,44],[6,45,6,46],[6,47,6,48],[6,49,6,50],[6,29,6,30],[6,31,6,32],[6,33,6,34],[6,35,6,36],[6,37,6,38],[6,39,6,40],[6,27,6,28],[6,17,6,18],[6,19,6,20],[6,21,6,22],[6,23,6,24],[6,25,6,26]]}
[null,null,"MINISTERIO DE COMUNICACIONES, INFRAESTRUCTURA Y VIVIENDA"]
[]
[null,null,"SEGUIMIENTO DE EJECUCIÓN FÍSICA Y FINANCIERA"]
[null,null,"AÑO",2023]
[]
[null,null,null,null,null,null,null,null,null,null,null,null,null,null,null,null,null,"FÍSICA",null,null,null,null,null,null,null,null,null,null,null,null,null,null,null,null,null,null,null,null,null,null,null,"FINANCIERO"]
[null,null,null,null,null,null,null,null,null,null,"FÍSICO",null,null,null,"FINANCIERO",null,null,"ENERO",null,"FEBRERO",null,"MARZO",null,"ABRIL",null,"MAYO",null,"JUNIO",null,"JULIO",null,"AGOSTO",null,"SEPTIEMBRE",null,"OCTUBRE",null,"NOVIEMBRE",null,"DICIEMBRE",null,"ENERO",null,"FEBRERO",null,"MARZO",null,"ABRIL",null,"MAYO",null,"JUNIO",null,"JULIO",null,"AGOSTO",null,"SEPTIEMBRE",null,"OCTUBRE",null,"NOVIEMBRE",null,"DICIEMBRE"]
["CONCATENADO",null,"UNIDAD","PG","SP","PY","ACT","OB","PRODUCTO","SUBPRODUCTO","UNIDAD DE\nMEDIDA","INICIAL","VIGENTE","EJECUTADO\nACUMULADO","INICIAL","VIGENTE","EJECUTADO\nACUMULADO","MOD","EJEC","MOD","EJEC","MOD","EJEC","MOD","EJEC","MOD","EJEC","MOD","EJEC","MOD","EJEC","MOD","EJEC","MOD","EJEC","MOD","EJEC","MOD","EJEC","MOD","EJEC","MOD","EJEC","MOD","EJEC","MOD","EJEC","MOD","EJEC","MOD","EJEC","MOD","EJEC","MOD","EJEC","MOD","EJEC","MOD","EJEC","MOD","EJEC","MOD","EJEC","MOD","EJEC"]
[{"$f":"CONCATENATE(C9,\"-\",J9)","v":"201-"},null,201,"01","00","000","003","000","000-001",null,"Evento",{"$f":"IFERROR(VLOOKUP($A9,ENEMT!$A$1:$O$1776,11,FALSE),0)","v":0},{"$f":"+L9+R9+T9+V9+X9+Z9+AB9+AD9+AF9+AH9+AJ9+AL9+AN9","v":0},{"$f":"+S9+U9+W9+Y9+AA9+AC9+AE9+AG9+AI9+AK9+AM9+AO9","v":0},{"$f":"IFERROR(VLOOKUP($A9,ENEFN!$A$2:$N$1776,5,FALSE),0)","v":0},{"$f":"+O9+AP9+AR9+AT9+AV9+AX9+AZ9+BB9+BD9+BF9+BH9+BJ9+BL9","v":0},{"$f":"+AQ9+AS9+AU9+AW9+AY9+BA9+BC9+BE9+BG9+BI9+BK9+BM9","v":0},{"$f":"IFERROR(VLOOKUP($A9,ENEMT!$A$1:$O$1776,12,FALSE),0)","v":0},{"$f":"IFERROR(VLOOKUP($A9,ENEMT!$A$1:$O$1776,15,FALSE),0)","v":0},null,null,null,null,null,null,null,null,null,null,null,null,null,null,null,null,null,null,null,null,null,null,{"$f":"IFERROR(VLOOKUP($A9,ENEFN!$A$1:$N$1776,6,FALSE),0)","v":0},{"$f":"IFERROR(VLOOKUP($A9,ENEFN!$A$1:$N$1776,10,FALSE),0)","v":0}]
[{"$f":"CONCATENATE(C10,\"-\",J10)","v":"201-000-001-0001"},null,201,"01","00","000","003","000",null,"000-001-0001","Evento",{"$f":"IFERROR(VLOOKUP($A10,ENEMT!$A$1:$O$1776,11,FALSE),0)","v":31},{"$f":"+L10+R10+T10+V10+X10+Z10+AB10+AD10+AF10+AH10+AJ10+AL10+AN10","v":31},{"$f":"+S10+U10+W10+Y10+AA10+AC10+AE10+AG10+AI10+AK10+AM10+AO10","v":0},{"$f":"IFERROR(VLOOKUP($A10,ENEFN!$A$2:$N$1776,5,FALSE),0)","v":15083171},{"$f":"+O10+AP10+AR10+AT10+AV10+AX10+AZ10+BB10+BD10+BF10+BH10+BJ10+BL10","v":15083171},{"$f":"+AQ10+AS10+AU10+AW10+AY10+BA10+BC10+BE10+BG10+BI10+BK10+BM10","v":0},{"$f":"IFERROR(VLOOKUP($A10,ENEMT!$A$1:$O$1776,12,FALSE),0)","v":0},{"$f":"IFERROR(VLOOKUP($A10,ENEMT!$A$1:$O$1776,15,FALSE),0)","v":0},null,null,null,null,null,null,null,null,null,null,null,null,null,null,null,null,null,null,null,null,null,null,{"$f":"IFERROR(VLOOKUP($A10,ENEFN!$A$1:$N$1776,6,FALSE),0)","v":0},{"$f":"IFERROR(VLOOKUP($A10,ENEFN!$A$1:$N$1776,10,FALSE),0)","v":0}]
["201-",null,201,"01","00","000","002","000","000-003",null,"Evento",{"$f":"IFERROR(VLOOKUP($A11,ENEMT!$A$1:$O$1776,11,FALSE),0)","v":0},0,0,{"$f":"IFERROR(VLOOKUP($A11,ENEFN!$A$2:$N$1776,5,FALSE),0)","v":0},0,0,{"$f":"IFERROR(VLOOKUP($A11,ENEMT!$A$1:$O$1776,12,FALSE),0)","v":0},{"$f":"IFERROR(VLOOKUP($A11,ENEMT!$A$1:$O$1776,15,FALSE),0)","v":0},null,null,null,null,null,null,null,null,null,null,null,null,null,null,null,null,null,null,null,null,null,null,{"$f":"IFERROR(VLOOKUP($A11,ENEFN!$A$1:$N$1776,6,FALSE),0)","v":0},{"$f":"IFERROR(VLOOKUP($A11,ENEFN!$A$1:$N$1776,10,FALSE),0)","v":0}]
["201-000-003-0001",null,201,"01","00","000","002","000",null,"000-003-0001","Evento",{"$f":"IFERROR(VLOOKUP($A12,ENEMT!$A$1:$O$1776,11,FALSE),0)","v":319},319,0,{"$f":"IFERROR(VLOOKUP($A12,ENEFN!$A$2:$N$1776,5,FALSE),0)","v":15893462},15893462,1907931.32,{"$f":"IFERROR(VLOOKUP($A12,ENEMT!$A$1:$O$1776,12,FALSE),0)","v":0},{"$f":"IFERROR(VLOOKUP($A12,ENEMT!$A$1:$O$1776,15,FALSE),0)","v":0},null,null,null,null,null,null,null,null,null,null,null,null,null,null,null,null,null,null,null,null,null,null,{"$f":"IFERROR(VLOOKUP($A12,ENEFN!$A$1:$N$1776,6,FALSE),0)","v":0},{"$f":"IFERROR(VLOOKUP($A12,ENEFN!$A$1:$N$1776,10,FALSE),0)","v":1907931.32}]
["201-",null,201,"99","00","000","001","000","000-004",null,"Aporte",{"$f":"IFERROR(VLOOKUP($A13,ENEMT!$A$1:$O$1776,11,FALSE),0)","v":0},0,0,{"$f":"IFERROR(VLOOKUP($A13,ENEFN!$A$2:$N$1776,5,FALSE),0)","v":0},0,0,{"$f":"IFERROR(VLOOKUP($A13,ENEMT!$A$1:$O$1776,12,FALSE),0)","v":0},{"$f":"IFERROR(VLOOKUP($A13,ENEMT!$A$1:$O$1776,15,FALSE),0)","v":0},null,null,null,null,null,null,null,null,null,null,null,null,null,null,null,null,null,null,null,null,null,null,{"$f":"IFERROR(VLOOKUP($A13,ENEFN!$A$1:$N$1776,6,FALSE),0)","v":0},{"$f":"IFERROR(VLOOKUP($A13,ENEFN!$A$1:$N$1776,10,FALSE),0)","v":0}]
["201-000-004-0001",null,201,"99","00","000","001","000",null,"000-004-0001","Aporte",{"$f":"IFERROR(VLOOKUP($A14,ENEMT!$A$1:$O$1776,11,FALSE),0)","v":13},13,0,{"$f":"IFERROR(VLOOKUP($A14,ENEFN!$A$2:$N$1776,5,FALSE),0)","v":5874520},5874520,384339,{"$f":"IFERROR(VLOOKUP($A14,ENEMT!$A$1:$O$1776,12,FALSE),0)","v":0},{"$f":"IFERROR(VLOOKUP($A14,ENEMT!$A$1:$O$1776,15,FALSE),0)","v":0},null,null,null,null,null,null,null,null,null,null,null,null,null,null,null,null,null,null,null,null,null,null,{"$f":"IFERROR(VLOOKUP($A14,ENEFN!$A$1:$N$1776,6,FALSE),0)","v":0},{"$f":"IFERROR(VLOOKUP($A14,ENEFN!$A$1:$N$1776,10,FALSE),0)","v":384339}]
["201-",null,201,"99","00","000","002","000","000-005",null,"Aporte",{"$f":"IFERROR(VLOOKUP($A15,ENEMT!$A$1:$O$1776,11,FALSE),0)","v":0},0,0,{"$f":"IFERROR(VLOOKUP($A15,ENEFN!$A$2:$N$1776,5,FALSE),0)","v":0},0,0,{"$f":"IFERROR(VLOOKUP($A15,ENEMT!$A$1:$O$1776,12,FALSE),0)","v":0},{"$f":"IFERROR(VLOOKUP($A15,ENEMT!$A$1:$O$1776,15,FALSE),0)","v":0},null,null,null,null,null,null,null,null,null,null,null,null,null,null,null,null,null,null,null,null,null,null,{"$f":"IFERROR(VLOOKUP($A15,ENEFN!$A$1:$N$1776,6,FALSE),0)","v":0},{"$f":"IFERROR(VLOOKUP($A15,ENEFN!$A$1:$N$1776,10,FALSE),0)","v":0}]
{"$rows_left_out":145}
{"sheet":"ENEMT","index":2,"n_rows":625,"n_cols":15,"rows_kept":625,"cut":false,"hidden":true,"merged":[]}
["CONCATENADO","PRODUCTO","UNIDAD","DESCRIPCION","PG","SP","PY","ACT","OB","UNIDAD DE MEDIDA","INICIAL","MODIFICADO","VIGENTE","PROGRAMADO","EJECUTADO"]
["201-000-001","000-001",201,"Servicios Financieros",1,0,0,3,0,"Evento",31,0,31,0,0]
["201-000-001-0001","000-001-0001",201,"Servicios Financieros",1,0,0,3,0,"Evento",31,0,31,0,0]
["201-000-003","000-003",201,"Servicios Administrativos",1,0,0,2,0,"Evento",319,0,319,0,0]
["201-000-003-0001","000-003-0001",201,"Servicios Administrativos",1,0,0,2,0,"Evento",319,0,319,0,0]
["201-000-004","000-004",201,"Personas Jurídicas Beneficiadas Con Aportes Y/O Cuotas Para Transporte",99,0,0,1,0,"Aporte",13,0,13,0,0]
["201-000-004-0001","000-004-0001",201,"Personas Jurídicas Beneficiadas Con Aportes Y/O Cuotas Para Transporte",99,0,0,1,0,"Aporte",13,0,13,0,0]
["201-000-005","000-005",201,"Personas Jurídicas Beneficiadas Con Aportes Y/O Cuotas Para Comunicaciones",99,0,0,2,0,"Aporte",1,0,1,0,0]
["201-000-005-0001","000-005-0001",201,"Personas Jurídicas Beneficiadas Con Aportes Y/O Cuotas Para Comunicaciones",99,0,0,2,0,"Aporte",1,0,1,0,0]
["201-000-006","000-006",201,"Personas Jurídicas Beneficiadas Con Aportes Y/O Cuotas Para Control Del Medio Ambiente",99,0,0,3,0,"Aporte",1,0,1,0,0]
["201-000-006-0001","000-006-0001",201,"Personas Jurídicas  Beneficiadas Con Aportes Y/O Cuotas Para Control Del Medio Ambiente",99,0,0,3,0,"Aporte",1,0,1,0,0]
["201-000-009","000-009",201,"Dirección Superior",1,0,0,1,0,"Evento",216,11,227,0,0]
["201-000-009-0001","000-009-0001",201,"Dirección Superior",1,0,0,1,0,"Evento",216,11,227,0,0]
["202-017-003","017-003",202,"Dirección Y Coordinación",11,0,0,1,0,"Evento",472,0,472,0,0]
["202-017-003-0001","017-003-0001",202,"Dirección Y Coordinación",11,0,0,1,0,"Evento",472,0,472,0,0]
{"$rows_left_out":611}
{"sheet":"ENEFN","index":3,"n_rows":420,"n_cols":14,"rows_kept":420,"cut":false,"hidden":true,"merged":[]}
["CONCATENADO","PRODUCTO","DESCRIPCION","UNIDAD","ASIGNADO","MODIFICADO","VIGENTE","PRECOMPROMISO","COMPROMETIDO","DEVENGADO","SALDO POR COMPROMETER","SALDO POR DEVENGAR","% EJEC","Columna1"]
["201-000-001-0001","000-001-0001","Servicios financieros",201,15083171,0,15083171,0,0,0,15083171,15083171,0,"201-000-001-0001"]
["201-000-003-0001","000-003-0001","Servicios administrativos",201,15893462,0,15893462,0,1907931.32,1907931.32,13985530.68,13985530.68,12.004504242058774,"201-000-003-0001"]
["201-000-004-0001","000-004-0001","Personas jurídicas beneficiadas con aportes y/o cuotas para transporte",201,5874520,0,5874520,0,384339,384339,5490181,5490181,6.5424749596562837,"201-000-004-0001"]
["201-000-005-0001","000-005-0001","Personas jurídicas beneficiadas con aportes y/o cuotas para comunicaciones",201,55159,0,55159,0,54464.94,54464.94,694.06,694.06,98.741710328323563,"201-000-005-0001"]
["201-000-006-0001","000-006-0001","Personas jurídicas  beneficiadas con aportes y/o cuotas para control del medio ambiente",201,400000,0,400000,0,0,0,400000,400000,0,"201-000-006-0001"]
["201-000-009-0001","000-009-0001","Dirección superior",201,25693688,0,25693688,0,0,0,25693688,25693688,0,"201-000-009-0001"]
["202-017-003-0001","017-003-0001","Dirección y coordinación",202,89558631,0,89558631,0,778525.64,778525.64,88780105.359999999,88780105.359999999,0.86929158173486942,"202-017-003-0001"]
["202-017-005-0001","017-005-0001","Red vial con servicios de mantenimiento",202,201689369,0,201689369,0,2822.84,2822.84,201686546.16,201686546.16,1.3995978141974777E-3,"202-017-005-0001"]
["202-017-008-0001","017-008-0001","Red vial con servicios de rehabilitación",202,311854271,0,311854271,0,0,0,311854271,311854271,0,"202-017-008-0001"]
["203-017-001-0003","017-001-0003","Red vial pavimentada con servicios de mantenimiento (fideicomiso)",203,5240000,0,5240000,0,0,0,5240000,5240000,0,"203-017-001-0003"]
["203-017-002-0001","017-002-0001","Red vial pavimentada con mantenimiento (ejecución normal)",203,793952274,0,793952274,0,0,0,793952274,793952274,0,"203-017-002-0001"]
["203-017-003-0001","017-003-0001","Dirección y coordinación",203,27407860,0,27407860,0,0,0,27407860,27407860,0,"203-017-003-0001"]
["203-017-006-0002","017-006-0002","Red vial rural con servicios de mantenimiento (fideicomiso)",203,5000000,0,5000000,0,0,0,5000000,5000000,0,"203-017-006-0002"]
["203-017-007-0001","017-007-0001","Red vial terciaria con mantenimiento (ejecución normal)",203,550792866,0,550792866,0,0,0,550792866,550792866,0,"203-017-007-0001"]
{"$rows_left_out":406}
{"sheet":"FEBMT","index":4,"n_rows":625,"n_cols":15,"rows_kept":625,"cut":false,"hidden":true,"merged":[]}
["CONCATENADO","PRODUCTO","UNIDAD","DESCRIPCION","PG","SP","PY","ACT","OB","UNIDAD DE MEDIDA","INICIAL","MODIFICADO","VIGENTE","PROGRAMADO","EJECUTADO"]
["201-000-001","000-001",201,"Servicios Financieros",1,0,0,3,0,"Evento",31,0,31,26,0]
["201-000-001-0001","000-001-0001",201,"Servicios Financieros",1,0,0,3,0,"Evento",31,0,31,26,0]
["201-000-003","000-003",201,"Servicios Administrativos",1,0,0,2,0,"Evento",319,0,319,104,0]
["201-000-003-0001","000-003-0001",201,"Servicios Administrativos",1,0,0,2,0,"Evento",319,0,319,104,0]
["201-000-004","000-004",201,"Personas Jurídicas Beneficiadas Con Aportes Y/O Cuotas Para Transporte",99,0,0,1,0,"Aporte",13,0,13,3,0]
["201-000-004-0001","000-004-0001",201,"Personas Jurídicas Beneficiadas Con Aportes Y/O Cuotas Para Transporte",99,0,0,1,0,"Aporte",13,0,13,3,0]
["201-000-005","000-005",201,"Personas Jurídicas Beneficiadas Con Aportes Y/O Cuotas Para Comunicaciones",99,0,0,2,0,"Aporte",1,0,1,1,0]
["201-000-005-0001","000-005-0001",201,"Personas Jurídicas Beneficiadas Con Aportes Y/O Cuotas Para Comunicaciones",99,0,0,2,0,"Aporte",1,0,1,1,0]
["201-000-006","000-006",201,"Personas Jurídicas Beneficiadas Con Aportes Y/O Cuotas Para Control Del Medio Ambiente",99,0,0,3,0,"Aporte",1,0,1,0,0]
["201-000-006-0001","000-006-0001",201,"Personas Jurídicas  Beneficiadas Con Aportes Y/O Cuotas Para Control Del Medio Ambiente",99,0,0,3,0,"Aporte",1,0,1,0,0]
["201-000-009","000-009",201,"Dirección Superior",1,0,0,1,0,"Evento",216,11,227,146,0]
["201-000-009-0001","000-009-0001",201,"Dirección Superior",1,0,0,1,0,"Evento",216,11,227,146,0]
["202-017-003","017-003",202,"Dirección Y Coordinación",11,0,0,1,0,"Evento",472,0,472,250,0]
["202-017-003-0001","017-003-0001",202,"Dirección Y Coordinación",11,0,0,1,0,"Evento",472,0,472,250,0]
{"$rows_left_out":611}
{"sheet":"FEBFN","index":5,"n_rows":420,"n_cols":14,"rows_kept":420,"cut":false,"hidden":true,"merged":[]}
["CONCATENADO","PRODUCTO","DESCRIPCION","UNIDAD","ASIGNADO","MODIFICADO","VIGENTE","PRECOMPROMISO","COMPROMETIDO","DEVENGADO","SALDO POR COMPROMETER","SALDO POR DEVENGAR","% EJEC","Columna1"]
["201-000-001-0001","000-001-0001","Servicios financieros",201,15083171,-708597,14374574,0,0,0,14374574,14374574,0,"201-000-001-0001"]
["201-000-003-0001","000-003-0001","Servicios administrativos",201,15893462,515356,16408818,0,1290774.04,1282519.04,13210112.640000001,13218367.640000001,19.443511165764647,"201-000-003-0001"]
["201-000-004-0001","000-004-0001","Personas jurídicas beneficiadas con aportes y/o cuotas para transporte",201,5874520,0,5874520,0,505774,505774,4984407,4984407,15.152097533075048,"201-000-004-0001"]
["201-000-005-0001","000-005-0001","Personas jurídicas beneficiadas con aportes y/o cuotas para comunicaciones",201,55159,0,55159,0,0,-1363.82,694.06,2057.88,96.269185445711486,"201-000-005-0001"]
["201-000-006-0001","000-006-0001","Personas jurídicas  beneficiadas con aportes y/o cuotas para control del medio ambiente",201,400000,0,400000,0,391064.5,391064.5,8935.5,8935.5,97.766124999999988,"201-000-006-0001"]
["201-000-009-0001","000-009-0001","Dirección superior",201,25693688,193241,25886929,0,3173.5,3173.5,25883755.5,25883755.5,1.225908256634284E-2,"201-000-009-0001"]
["202-017-003-0001","017-003-0001","Dirección y coordinación",202,89558631,275900,89834531,0,2292998.7000000002,2217877.62,86763006.659999996,86838127.739999995,3.3354693642247728,"202-017-003-0001"]
["202-017-005-0001","017-005-0001","Red vial con servicios de mantenimiento",202,201689369,-275900,201413469,0,11569648.48,11142958.25,189840997.68000001,190267687.91,5.5337814026727212,"202-017-005-0001"]
["202-017-008-0001","017-008-0001","Red vial con servicios de rehabilitación",202,311854271,0,311854271,0,166119397.55000001,165955202.71000001,145734873.44999999,145899068.28999999,53.215626060801966,"202-017-008-0001"]
["203-000-049-0001","000-049-0001","Intervenciones realizadas para la atención de la emergencia por Época Lluviosa, Temporada Ciclónica y Sistema de Baja Presión",203,0,50000000,50000000,0,0,0,50000000,50000000,0,"203-000-049-0001"]
["203-000-051-0001","000-051-0001","Intervenciones realizadas para la atención de la emergencia provocada por los efectos de la época lluviosa y el Ciclón Tropical Julia",203,0,300000000,300000000,0,0,0,300000000,300000000,0,"203-000-051-0001"]
["203-017-001-0003","017-001-0003","Red vial pavimentada con servicios de mantenimiento (fideicomiso)",203,5240000,0,5240000,0,0,0,5240000,5240000,0,"203-017-001-0003"]
["203-017-002-0001","017-002-0001","Red vial pavimentada con mantenimiento (ejecución normal)",203,793952274,-243739226,550213048,0,57037015.329999998,57037015.329999998,493176032.67000002,493176032.67000002,10.366350913946334,"203-017-002-0001"]
["203-017-003-0001","017-003-0001","Dirección y coordinación",203,27407860,0,27407860,0,372209.57,372209.57,27035650.43,27035650.43,1.3580395185906491,"203-017-003-0001"]
{"$rows_left_out":406}
{"sheet":"MARMT","index":6,"n_rows":1,"n_cols":15,"rows_kept":1,"cut":false,"hidden":true,"merged":[]}
["CONCATENADO","PRODUCTO","UNIDAD","DESCRIPCION","PG","SP","PY","ACT","OB","UNIDAD DE MEDIDA","INICIAL","MODIFICADO","VIGENTE","PROGRAMADO","EJECUTADO"]

{"sheet":"MARFN","index":7,"n_rows":1,"n_cols":14,"rows_kept":1,"cut":false,"hidden":true,"merged":[]}
["CONCATENADO","PRODUCTO","DESCRIPCION","UNIDAD","ASIGNADO","MODIFICADO","VIGENTE","PRECOMPROMISO","COMPROMETIDO","DEVENGADO","SALDO POR COMPROMETER","SALDO POR DEVENGAR","% EJEC","Columna1"]

{"sheet":"ABRMT","index":8,"n_rows":1,"n_cols":15,"rows_kept":1,"cut":false,"hidden":true,"merged":[]}
["CONCATENADO","PRODUCTO","UNIDAD","DESCRIPCION","PG","SP","PY","ACT","OB","UNIDAD DE MEDIDA","INICIAL","MODIFICADO","VIGENTE","PROGRAMADO","EJECUTADO"]

{"sheet":"ABRFN","index":9,"n_rows":1,"n_cols":14,"rows_kept":1,"cut":false,"hidden":true,"merged":[]}
["CONCATENADO","PRODUCTO","DESCRIPCION","UNIDAD","ASIGNADO","MODIFICADO","VIGENTE","PRECOMPROMISO","COMPROMETIDO","DEVENGADO","SALDO POR COMPROMETER","SALDO POR DEVENGAR","% EJEC","Columna1"]

{"sheet":"MAYMT","index":10,"n_rows":1,"n_cols":15,"rows_kept":1,"cut":false,"hidden":true,"merged":[]}
["CONCATENADO","PRODUCTO","UNIDAD","DESCRIPCION","PG","SP","PY","ACT","OB","UNIDAD DE MEDIDA","INICIAL","MODIFICADO","VIGENTE","PROGRAMADO","EJECUTADO"]

{"sheet":"MAYFN","index":11,"n_rows":1,"n_cols":14,"rows_kept":1,"cut":false,"hidden":true,"merged":[]}
["CONCATENADO","PRODUCTO","DESCRIPCION","UNIDAD","ASIGNADO","MODIFICADO","VIGENTE","PRECOMPROMISO","COMPROMETIDO","DEVENGADO","SALDO POR COMPROMETER","SALDO POR DEVENGAR","% EJEC","Columna1"]

{"sheet":"JUNFN","index":12,"n_rows":1,"n_cols":14,"rows_kept":1,"cut":false,"hidden":true,"merged":[]}
["CONCATENADO","PRODUCTO","DESCRIPCION","UNIDAD","ASIGNADO","MODIFICADO","VIGENTE","PRECOMPROMISO","COMPROMETIDO","DEVENGADO","SALDO POR COMPROMETER","SALDO POR DEVENGAR","% EJEC","Columna1"]

{"sheet":"JUNMT","index":13,"n_rows":1,"n_cols":15,"rows_kept":1,"cut":false,"hidden":true,"merged":[]}
["CONCATENADO","PRODUCTO","UNIDAD","DESCRIPCION","PG","SP","PY","ACT","OB","UNIDAD DE MEDIDA","INICIAL","MODIFICADO","VIGENTE","PROGRAMADO","EJECUTADO"]

{"sheet":"JULMT","index":14,"n_rows":1,"n_cols":15,"rows_kept":1,"cut":false,"hidden":true,"merged":[]}
["CONCATENADO","PRODUCTO","UNIDAD","DESCRIPCION","PG","SP","PY","ACT","OB","UNIDAD DE MEDIDA","INICIAL","MODIFICADO","VIGENTE","PROGRAMADO","EJECUTADO"]

{"sheet":"JULFN","index":15,"n_rows":1,"n_cols":14,"rows_kept":1,"cut":false,"hidden":true,"merged":[]}
["CONCATENADO","PRODUCTO","DESCRIPCION","UNIDAD","ASIGNADO","MODIFICADO","VIGENTE","PRECOMPROMISO","COMPROMETIDO","DEVENGADO","SALDO POR COMPROMETER","SALDO POR DEVENGAR","% EJEC","Columna1"]

{"sheet":"AGOMT","index":16,"n_rows":1,"n_cols":15,"rows_kept":1,"cut":false,"hidden":true,"merged":[]}
["CONCATENADO","PRODUCTO","UNIDAD","DESCRIPCION","PG","SP","PY","ACT","OB","UNIDAD DE MEDIDA","INICIAL","MODIFICADO","VIGENTE","PROGRAMADO","EJECUTADO"]

{"sheet":"AGOFN","index":17,"n_rows":1,"n_cols":14,"rows_kept":1,"cut":false,"hidden":true,"merged":[]}
["CONCATENADO","PRODUCTO","DESCRIPCION","UNIDAD","ASIGNADO","MODIFICADO","VIGENTE","PRECOMPROMISO","COMPROMETIDO","DEVENGADO","SALDO POR COMPROMETER","SALDO POR DEVENGAR","% EJEC","Columna1"]

{"sheet":"SEPMT","index":18,"n_rows":1,"n_cols":15,"rows_kept":1,"cut":false,"hidden":true,"merged":[]}
["CONCATENADO","PRODUCTO","UNIDAD","DESCRIPCION","PG","SP","PY","ACT","OB","UNIDAD DE MEDIDA","INICIAL","MODIFICADO","VIGENTE","PROGRAMADO","EJECUTADO"]

{"sheet":"SEPFN","index":19,"n_rows":1,"n_cols":14,"rows_kept":1,"cut":false,"hidden":true,"merged":[]}
["CONCATENADO","PRODUCTO","DESCRIPCION","UNIDAD","ASIGNADO","MODIFICADO","VIGENTE","PRECOMPROMISO","COMPROMETIDO","DEVENGADO","SALDO POR COMPROMETER","SALDO POR DEVENGAR","% EJEC","Columna1"]

{"sheet":"OCTMT","index":20,"n_rows":1,"n_cols":15,"rows_kept":1,"cut":false,"hidden":true,"merged":[]}
["CONCATENADO","PRODUCTO","UNIDAD","DESCRIPCION","PG","SP","PY","ACT","OB","UNIDAD DE MEDIDA","INICIAL","MODIFICADO","VIGENTE","PROGRAMADO","EJECUTADO"]

{"sheet":"OCTFN","index":21,"n_rows":1,"n_cols":14,"rows_kept":1,"cut":false,"hidden":true,"merged":[]}
["CONCATENADO","PRODUCTO","DESCRIPCION","UNIDAD","ASIGNADO","MODIFICADO","VIGENTE","PRECOMPROMISO","COMPROMETIDO","DEVENGADO","SALDO POR COMPROMETER","SALDO POR DEVENGAR","% EJEC","Columna1"]

{"sheet":"NOVMT","index":22,"n_rows":1,"n_cols":15,"rows_kept":1,"cut":false,"hidden":true,"merged":[]}
["CONCATENADO","PRODUCTO","UNIDAD","DESCRIPCION","PG","SP","PY","ACT","OB","UNIDAD DE MEDIDA","INICIAL","MODIFICADO","VIGENTE","PROGRAMADO","EJECUTADO"]

{"sheet":"NOVFN","index":23,"n_rows":1,"n_cols":14,"rows_kept":1,"cut":false,"hidden":true,"merged":[]}
["CONCATENADO","PRODUCTO","DESCRIPCION","UNIDAD","ASIGNADO","MODIFICADO","VIGENTE","PRECOMPROMISO","COMPROMETIDO","DEVENGADO","SALDO POR COMPROMETER","SALDO POR DEVENGAR","% EJEC","Columna1"]

{"sheet":"DICMT","index":24,"n_rows":1,"n_cols":15,"rows_kept":1,"cut":false,"hidden":true,"merged":[]}
["CONCATENADO","PRODUCTO","UNIDAD","DESCRIPCION","PG","SP","PY","ACT","OB","UNIDAD DE MEDIDA","INICIAL","MODIFICADO","VIGENTE","PROGRAMADO","EJECUTADO"]

{"sheet":"DICFN","index":25,"n_rows":1,"n_cols":14,"rows_kept":1,"cut":false,"hidden":true,"merged":[]}
["CONCATENADO","PRODUCTO","DESCRIPCION","UNIDAD","ASIGNADO","MODIFICADO","VIGENTE","PRECOMPROMISO","COMPROMETIDO","DEVENGADO","SALDO POR COMPROMETER","SALDO POR DEVENGAR","% EJEC","Columna1"]